BDBM2174 (3-(2-tert-Butyl-4-hydroxymethyl-5-methyl-phenylsulfanyl)-4-hydroxy-6-[2-(4-hydroxy-phenyl)-ethyl]-6-propyl-5,6-dihydro-pyran-2-one::3-{[2-tert-butyl-4-(hydroxymethyl)-5-methylphenyl]sulfanyl}-4-hydroxy-6-[2-(4-hydroxyphenyl)ethyl]-6-propyl-5,6-dihydro-2H-pyran-2-one::PD 178390 Analog 13
SMILES CCCC1(CCc2ccc(O)cc2)CC(=O)C(Sc2cc(C)c(CO)cc2C(C)(C)C)C(=O)O1
InChI Key InChIKey=WCYLQTDFQDALRK-UHFFFAOYSA-N
Data  1 IC50
  Tab Delimited (TSV)   2D SDfile   Computed 3D by Vconf -m prep SDfile
Find this compound or compounds like it in BindingDB:
Activity Spreadsheet -- Enzyme Inhibition Constant Data from BindingDB
Found 1 hit for monomerid = 2174
TargetDimer of Gag-Pol polyprotein [489-587](Human immunodeficiency virus type 1)
Parke-Davis Pharmaceutical Research
LigandPNGBDBM2174((3-(2-tert-Butyl-4-hydroxymethyl-5-methyl-phenylsu...)
Affinity DataIC50:  2.60nMpH: 6.2 T: 2°C. Assay description: For determination of IC50 values, HIV-1 protease was added to assay buffer containing inhibitor and the substrate (H-His-Lys-Ala-Arg-Val-Leu- (p-NO2)...
In DepthDetails ArticlePubMed